Target
Telomerase reverse transcriptase
Ligand
BDBM50079528
Substrate
Meas. Tech.
ChEMBL_1471283 (CHEMBL3418582)
IC50
110±n/a nM
Citation
 Tang, WJWang, JTong, XShi, JBLiu, XHLi, J Design and synthesis of celastrol derivatives as anticancer agents. Eur J Med Chem 95:166-73 (2015)  
Target
Name:
Telomerase reverse transcriptase
Synonyms:
EST2 TERT TRT
Type:
PROTEIN
Mol. Mass.:
127099.03
Organism:
Homo sapiens (Human)
Description:
ChEMBL_1447029
Residue:
1132
  
Inhibitor
Name:
BDBM50079528
Synonyms:
CHEMBL3417316
Type:
Small organic molecule
Emp. Form.:
C31H43NO4
Mol. Mass.:
493.6774
SMILES:
[H][C@@]12C[C@@](C)(CC[C@]1(C)CC[C@]1(C)C3=CC=C4C(C)=C(O)C(=O)C=C4[C@]3(C)CC[C@@]21C)C(=O)NCCO
: