Target
Glutamate carboxypeptidase 2
Ligand
BDBM50102258
Substrate
Meas. Tech.
ChEMBL_1471476 (CHEMBL3419861)
Ki
8.0±n/a nM
Citation
 Roy, JNguyen, TXKanduluru, AKVenkatesh, CLv, WReddy, PVLow, PSCushman, M DUPA conjugation of a cytotoxic indenoisoquinoline topoisomerase I inhibitor for selective prostate cancer cell targeting. J Med Chem 58:3094-103 (2015)  
Target
Name:
Glutamate carboxypeptidase 2
Synonyms:
FGCP FOLH1 Folate hydrolase 1 Glutamate carboxypeptidase 2 Membrane glutamate carboxypeptidase NAALAD1 PSM Prostate-specific membrane antigen mGCP
Type:
PROTEIN
Mol. Mass.:
84333.66
Organism:
Homo sapiens (Human)
Description:
ChEMBL_1497035
Residue:
750
  
Inhibitor
Name:
BDBM50102258
Synonyms:
(S)-2-[3-((S)-3-Carboxy-1-carboxy-propyl)-ureido]-pentanedioic acid CHEMBL46005
Type:
Small organic molecule
Emp. Form.:
C11H16N2O9
Mol. Mass.:
320.2527
SMILES:
OC(=O)CC[C@H](NC(=O)N[C@@H](CCC(O)=O)C(O)=O)C(O)=O
: