Target
Hepatocyte growth factor receptor
Ligand
BDBM50079545
Substrate
Meas. Tech.
ChEMBL_1471545 (CHEMBL3420280)
IC50
300±n/a nM
Citation
 Xing, WAi, JJin, SShi, ZPeng, XWang, LJi, YLu, DLiu, YGeng, MHu, Y Enhancing the cellular anti-proliferation activity of pyridazinones as c-met inhibitors using docking analysis. Eur J Med Chem 95:302-12 (2015)  
Target
Name:
Hepatocyte growth factor receptor
Synonyms:
Hepatocyte growth factor receptor Hepatocyte growth factor receptor (c-MET) MET Met proto-oncogene (hepatocyte growth factor receptor) Tyrosine-protein kinase Met (c-Met) c-Met kinase
Type:
Protein
Mol. Mass.:
155559.73
Organism:
Homo sapiens (Human)
Description:
P08581
Residue:
1390
  
Inhibitor
Name:
BDBM50079545
Synonyms:
CHEMBL3417469
Type:
Small organic molecule
Emp. Form.:
C24H28ClN5O3
Mol. Mass.:
469.964
SMILES:
CN(C)CCCCOC(=O)Nc1cccc(Cn2nc(Nc3cccc(Cl)c3)ccc2=O)c1
: