Target
Vascular endothelial growth factor receptor 1
Ligand
BDBM50079565
Substrate
Meas. Tech.
ChEMBL_1471570 (CHEMBL3420305)
IC50
>1000±n/a nM
Citation
 Xing, WAi, JJin, SShi, ZPeng, XWang, LJi, YLu, DLiu, YGeng, MHu, Y Enhancing the cellular anti-proliferation activity of pyridazinones as c-met inhibitors using docking analysis. Eur J Med Chem 95:302-12 (2015)  
Target
Name:
Vascular endothelial growth factor receptor 1
Synonyms:
FLT FRT Fms-like tyrosine kinase 1 Tyrosine-protein kinase FRT VEGFR-1 VGFR1_HUMAN Vascular endothelial growth factor receptor 1 (FLT1) Vascular endothelial growth factor receptor 1 and 2 (Flt-1 and KDR) Vascular permeability factor receptor vascular endothelial growth factor/vascular permeability factor receptor
Type:
Receptor Tyrosine Kinase
Mol. Mass.:
150800.23
Organism:
Homo sapiens (Human)
Description:
P17948
Residue:
1338
  
Inhibitor
Name:
BDBM50079565
Synonyms:
CHEMBL3417489
Type:
Small organic molecule
Emp. Form.:
C30H30FN5O4
Mol. Mass.:
543.5887
SMILES:
Fc1ccc2ccn(-c3ccc(=O)n(CCOc4ccnc5cc(OCCCN6CCOCC6)ccc45)n3)c2c1
: