Target
Epidermal growth factor receptor
Ligand
BDBM50079565
Substrate
Meas. Tech.
ChEMBL_1471571 (CHEMBL3420306)
IC50
>1000±n/a nM
Citation
 Xing, WAi, JJin, SShi, ZPeng, XWang, LJi, YLu, DLiu, YGeng, MHu, Y Enhancing the cellular anti-proliferation activity of pyridazinones as c-met inhibitors using docking analysis. Eur J Med Chem 95:302-12 (2015)  
Target
Name:
Epidermal growth factor receptor
Synonyms:
EGF Receptor Substrate EGFR_HUMAN ERBB1 Epidermal Growth Factor Receptor erbB-1 Epidermal growth factor receptor (EGFR) HER1 Proto-oncogene c-ErbB-1 Tyrosine-Protein Kinase ErbB-1
Type:
Receptor Kinase Domain
Mol. Mass.:
134279.59
Organism:
Homo sapiens (Human)
Description:
P00533
Residue:
1210
  
Inhibitor
Name:
BDBM50079565
Synonyms:
CHEMBL3417489
Type:
Small organic molecule
Emp. Form.:
C30H30FN5O4
Mol. Mass.:
543.5887
SMILES:
Fc1ccc2ccn(-c3ccc(=O)n(CCOc4ccnc5cc(OCCCN6CCOCC6)ccc45)n3)c2c1
: