Target
Protein mono-ADP-ribosyltransferase PARP15
Ligand
BDBM50079620
Substrate
Meas. Tech.
ChEMBL_1472394 (CHEMBL3420115)
IC50
1738±n/a nM
Citation
 Ekblad, TLindgren, AEAndersson, CDCaraballo, RThorsell, AGKarlberg, TSpjut, SLinusson, ASchüler, HElofsson, M Towards small molecule inhibitors of mono-ADP-ribosyltransferases. Eur J Med Chem 95:546-51 (2015)  
Target
Name:
Protein mono-ADP-ribosyltransferase PARP15
Synonyms:
(ARTD7 or PARP15) 2.4.2.- ADP-ribosyltransferase diphtheria toxin-like 7 B-aggressive lymphoma protein 3 Human diphtheria toxin-like ADP-ribosyltransferase (ARTD7 or PARP15, Y598L) PARP-15 Poly [ADP-ribose] polymerase 15 | Synonyms=BAL3
Type:
Mol. Mass.:
74595.89
Organism:
Homo sapiens (Human)
Description:
Q460N3
Residue:
678
  
Inhibitor
Name:
BDBM50079620
Synonyms:
CHEMBL3414775
Type:
Small organic molecule
Emp. Form.:
C12H12N2O4
Mol. Mass.:
248.2347
SMILES:
COC(=O)\C=C/C(=O)Nc1cccc(c1)C(N)=O
: