Target
Protein mono-ADP-ribosyltransferase PARP14
Ligand
BDBM50079616
Substrate
Meas. Tech.
ChEMBL_1472393 (CHEMBL3420114)
IC50
>20000±n/a nM
Citation
 Ekblad, TLindgren, AEAndersson, CDCaraballo, RThorsell, AGKarlberg, TSpjut, SLinusson, ASchüler, HElofsson, M Towards small molecule inhibitors of mono-ADP-ribosyltransferases. Eur J Med Chem 95:546-51 (2015)  
Target
Name:
Protein mono-ADP-ribosyltransferase PARP14
Synonyms:
(ARTD8 or PARP14) 2.4.2.- ADP-ribosyltransferase diphtheria toxin-like 8 B aggressive lymphoma protein 2 BAL2  KIAA1268 PAR14_HUMAN PARP14 Synonyms=BAL2
Type:
Mol. Mass.:
202812.41
Organism:
Homo sapiens (Human)
Description:
Q460N5
Residue:
1801
  
Inhibitor
Name:
BDBM50079616
Synonyms:
CHEMBL3414766
Type:
Small organic molecule
Emp. Form.:
C13H16N2O4
Mol. Mass.:
264.2771
SMILES:
CC(C)(CC(=O)Nc1cccc(c1)C(N)=O)C(O)=O
: