Target
Heme oxygenase 2
Ligand
BDBM50079990
Substrate
Meas. Tech.
ChEMBL_1470661 (CHEMBL3420440)
IC50
900±n/a nM
Citation
 Salerno, LPittalą, VRomeo, GModica, MNMarrazzo, ASiracusa, MASorrenti, VDi Giacomo, CVanella, LParayath, NNGreish, K Novel imidazole derivatives as heme oxygenase-1 (HO-1) and heme oxygenase-2 (HO-2) inhibitors and their cytotoxic activity in human-derived cancer cell lines. Eur J Med Chem 96:162-72 (2015)  
Target
Name:
Heme oxygenase 2
Synonyms:
HMOX2_RAT Heme oxygenase 2 | Hmox2
Type:
Enzyme
Mol. Mass.:
35754.99
Organism:
Rattus norvegicus (rat)
Description:
HO-2 obtained from rat brain was used in enzyme assays.
Residue:
315
  
Inhibitor
Name:
BDBM50079990
Synonyms:
CHEMBL3415252
Type:
Small organic molecule
Emp. Form.:
C14H14ClN3S2
Mol. Mass.:
323.864
SMILES:
Clc1ccc2sc(SCCCCn3ccnc3)nc2c1
: