Target
Matrix protein 2 [1-96]
Ligand
BDBM50079998
Substrate
Meas. Tech.
ChEMBL_1471014 (CHEMBL3420061)
IC50
6500±n/a nM
Citation
 Rey-Carrizo, MGazzarrini, SLlabrés, SFrigolé-Vivas, MJuárez-Jiménez, JFont-Bardia, MNaesens, LMoroni, ALuque, FJVázquez, S New polycyclic dual inhibitors of the wild type and the V27A mutant M2 channel of the influenza A virus with unexpected binding mode. Eur J Med Chem 96:318-29 (2015)  
Target
Name:
Matrix protein 2 [1-96]
Synonyms:
M Matrix protein 2
Type:
PROTEIN
Mol. Mass.:
11051.96
Organism:
Influenza A virus
Description:
ChEMBL_1453980
Residue:
96
  
Inhibitor
Name:
BDBM50079998
Synonyms:
CHEMBL3415950
Type:
Small organic molecule
Emp. Form.:
C17H21N3
Mol. Mass.:
267.3687
SMILES:
[H][C@]12[C@@]3([H])[C@@]4([H])[C@@]1([H])[C@]1([H])[C@@]5([H])CN(C[C@@]5([H])[C@@]4([H])[C@@]4([H])[C@]3([H])C=C[C@]2([H])[C@@]14[H])C(N)=N
: