Target
Carbonic anhydrase 2
Ligand
BDBM50080154
Substrate
Meas. Tech.
ChEMBL_1471327 (CHEMBL3418803)
Ki
13±n/a nM
Citation
 Awadallah, FMEl-Waei, TAHanna, MMAbbas, SECeruso, MOz, BEGuler, OOSupuran, CT Synthesis, carbonic anhydrase inhibition and cytotoxic activity of novel chromone-based sulfonamide derivatives. Eur J Med Chem 96:425-35 (2015)  
Target
Name:
Carbonic anhydrase 2
Synonyms:
CA-II CAC Carbonate dehydratase II Carbonic anhydrase 2 (CA-II) Carbonic anhydrase C Carbonic anhydrase II (CA-II) Carbonic anhydrase II (hCA II) | Carbonic anhydrase isoenzyme II (hCA II)
Type:
Enzyme
Mol. Mass.:
29250.71
Organism:
Homo sapiens (Human)
Description:
P00918
Residue:
260
  
Inhibitor
Name:
BDBM50080154
Synonyms:
CHEMBL3416235
Type:
Small organic molecule
Emp. Form.:
C19H13N3O5S2
Mol. Mass.:
427.454
SMILES:
NS(=O)(=O)c1ccc(NC2=NC(=O)\C(S2)=C/c2coc3ccccc3c2=O)cc1
: