Target
Carbonic anhydrase 1
Ligand
BDBM50080148
Substrate
Meas. Tech.
ChEMBL_1471326 (CHEMBL3418802)
Ki
>10000±n/a nM
Citation
 Awadallah, FMEl-Waei, TAHanna, MMAbbas, SECeruso, MOz, BEGuler, OOSupuran, CT Synthesis, carbonic anhydrase inhibition and cytotoxic activity of novel chromone-based sulfonamide derivatives. Eur J Med Chem 96:425-35 (2015)  
Target
Name:
Carbonic anhydrase 1
Synonyms:
CA-I CAB Carbonate dehydratase I Carbonic anhydrase 1 (CA I) Carbonic anhydrase 1 (Recombinant CA I) Carbonic anhydrase B Carbonic anhydrase I (CA I) Carbonic anhydrase I (CAI) Carbonic anhydrase isoenzyme I (hCA I) | hCA
Type:
Enzyme
Mol. Mass.:
28873.37
Organism:
Homo sapiens (Human)
Description:
P00915
Residue:
261
  
Inhibitor
Name:
BDBM50080148
Synonyms:
CHEMBL3416226
Type:
Small organic molecule
Emp. Form.:
C22H21N3O6S
Mol. Mass.:
455.484
SMILES:
CCOC1Oc2ccccc2C(=O)\C1=C\Nc1ccc(cc1)S(=O)(=O)Nc1cc(C)on1
: