Target
11-beta-hydroxysteroid dehydrogenase 1
Ligand
BDBM50080410
Substrate
Meas. Tech.
ChEMBL_1474764 (CHEMBL3424221)
IC50
7200±n/a nM
Citation
 Chen, XQShao, LDPal, MShen, YCheng, XXu, GPeng, LYWang, KPan, ZHLi, MMLeng, YHe, JZhao, QS Hupehenols A-E, selective 11ß-hydroxysteroid dehydrogenase type 1 (11ß-HSD1) inhibitors from Viburnum hupehense. J Nat Prod 78:330-4 (2015)  
Target
Name:
11-beta-hydroxysteroid dehydrogenase 1
Synonyms:
11-DH 11-beta-Hydroxysteroid Dehydrogenase 1 (11-beta-HSD1) 11beta-HSD1A Corticosteroid 11-beta-dehydrogenase isozyme 1 (11-beta-HSD-1) Hsd11 | Hsd11b1
Type:
Enzyme
Mol. Mass.:
32369.70
Organism:
Mus musculus (mouse)
Description:
P50172
Residue:
292
  
Inhibitor
Name:
BDBM50080410
Synonyms:
CHEMBL3422416
Type:
Small organic molecule
Emp. Form.:
C24H36O4
Mol. Mass.:
388.5402
SMILES:
[H][C@@]12C=CC(=O)[C@@]1(C)[C@]1(C)CC[C@@]3([H])C(C)(C)[C@@H](O)CC[C@]3(C)[C@@]1([H])C[C@H]2OC(C)=O
: