Target
Replication protein A 70 kDa DNA-binding subunit
Ligand
BDBM50080776
Substrate
Meas. Tech.
ChEMBL_1475234 (CHEMBL3425032)
Kd
123±n/a nM
Citation
 Waterson, AGKennedy, JPPatrone, JDPelz, NFFeldkamp, MDFrank, AOVangamudi, BSouza-Fagundes, EMRossanese, OWChazin, WJFesik, SW Diphenylpyrazoles as replication protein a inhibitors. ACS Med Chem Lett 6:140-5 (2015)  
Target
Name:
Replication protein A 70 kDa DNA-binding subunit
Synonyms:
REPA1 RFA1_HUMAN RPA1 Replication factor A protein 1 | Single-stranded DNA-binding protein
Type:
Enzyme
Mol. Mass.:
68139.43
Organism:
Homo sapiens (Human)
Description:
P27694
Residue:
616
  
Inhibitor
Name:
BDBM50080776
Synonyms:
CHEMBL3422444
Type:
Small organic molecule
Emp. Form.:
C16H10Cl2N2O2
Mol. Mass.:
333.169
SMILES:
OC(=O)c1cc(-c2ccccc2)n(n1)-c1ccc(Cl)c(Cl)c1
: