Target
Bifunctional ligase/repressor BirA
Ligand
BDBM50039492
Substrate
Meas. Tech.
ChEMBL_1475430 (CHEMBL3424423)
Ki
87±n/a nM
Citation
 Tieu, WPolyak, SWPaparella, ASYap, MYSoares da Costa, TPNg, BWang, GLumb, RBell, JMTurnidge, JDWilce, MCBooker, GWAbell, AD Improved Synthesis of Biotinol-5'-AMP: Implications for Antibacterial Discovery. ACS Med Chem Lett 6:216-20 (2015)  
Target
Name:
Bifunctional ligase/repressor BirA
Synonyms:
BIRA_ECOLI Biotin protein ligase (BPL) BirA Bifunctional Protein birA | dhbB
Type:
Repressor protein
Mol. Mass.:
35313.58
Organism:
Escherichia coli
Description:
Residue:
321
  
Inhibitor
Name:
BDBM50039492
Synonyms:
CHEMBL1231498
Type:
Small organic molecule
Emp. Form.:
C20H30N7O8PS
Mol. Mass.:
559.533
SMILES:
Nc1ncnc2n(cnc12)[C@@H]1O[C@H](CO[P@@](O)(=O)OCCCCC[C@@H]2SC[C@@H]3NC(=O)N[C@H]23)[C@@H](O)[C@H]1O
: