Target
Somatostatin receptor type 4
Ligand
BDBM50081059
Substrate
Meas. Tech.
ChEMBL_1475513 (CHEMBL3424506)
Ki
70±n/a nM
Citation
 Abdel-Magid, AF Treating pain with somatostatin receptor subtype 4 agonists. ACS Med Chem Lett 6:110-1 (2015)  
Target
Name:
Somatostatin receptor type 4
Synonyms:
SOMATOSTATIN SST4 SS4-R SSR4_HUMAN SSTR4 | Somatostatin receptor type 4 (SSTR4)
Type:
Enzyme
Mol. Mass.:
42015.38
Organism:
Homo sapiens (Human)
Description:
P31391
Residue:
388
  
Inhibitor
Name:
BDBM50081059
Synonyms:
CHEMBL3421845 US10675268, Example 138 | US9789082, Example 138
Type:
Small organic molecule
Emp. Form.:
C18H22N4O
Mol. Mass.:
310.3935
SMILES:
[H][C@@]12CNC[C@]1([H])[C@H]2C(=O)NC(C)(C)c1nc(C)nc2ccccc12
: