Target
Somatostatin receptor type 4
Ligand
BDBM50081058
Substrate
Meas. Tech.
ChEMBL_1475513 (CHEMBL3424506)
Ki
3.7±n/a nM
Citation
 Abdel-Magid, AF Treating pain with somatostatin receptor subtype 4 agonists. ACS Med Chem Lett 6:110-1 (2015)  
Target
Name:
Somatostatin receptor type 4
Synonyms:
SOMATOSTATIN SST4 SS4-R SSR4_HUMAN SSTR4 | Somatostatin receptor type 4 (SSTR4)
Type:
Enzyme
Mol. Mass.:
42015.38
Organism:
Homo sapiens (Human)
Description:
P31391
Residue:
388
  
Inhibitor
Name:
BDBM50081058
Synonyms:
CHEMBL3421842 US10675268, Example 22 | US9789082, Example 22
Type:
Small organic molecule
Emp. Form.:
C19H23N3O
Mol. Mass.:
309.4054
SMILES:
[H][C@@]12CNC[C@]1([H])[C@H]2C(=O)NC(C)(C)c1nc(C)cc2ccccc12
: