Target
Glucocorticoid receptor
Ligand
BDBM50081098
Substrate
Meas. Tech.
ChEMBL_1475546 (CHEMBL3424572)
IC50
>5000±n/a nM
Citation
 Chantigny, YAMurray, JCKleinman, EFRobinson, RPPlotkin, MAReese, MRBuckbinder, LMcNiff, PAMillham, MLSchaefer, JFAbramov, YABordner, J 2-Aryl-3-methyloctahydrophenanthrene-2,3,7-triols as potent dissociated glucocorticoid receptor agonists. J Med Chem 58:2658-77 (2015)  
Target
Name:
Glucocorticoid receptor
Synonyms:
GCR_HUMAN GRL Glucocorticoid receptor (GRFP) Nuclear receptor subfamily 3 group C member 1
Type:
Enzyme
Mol. Mass.:
85656.87
Organism:
Homo sapiens (Human)
Description:
P04150
Residue:
777
  
Inhibitor
Name:
BDBM50081098
Synonyms:
CHEMBL3421882
Type:
Small organic molecule
Emp. Form.:
C20H30O3
Mol. Mass.:
318.4504
SMILES:
[H][C@]12CCc3cc(O)ccc3[C@]1(CC)C[C@@](C)(O)[C@](O)(CCC)C2
: