Target
Dual specificity tyrosine-phosphorylation-regulated kinase 1B
Ligand
BDBM50081183
Substrate
Meas. Tech.
ChEMBL_1475745 (CHEMBL3424978)
IC50
34±n/a nM
Citation
 Kettle, JGBallard, PBardelle, CCockerill, MColclough, NCritchlow, SEDebreczeni, JFairley, GFillery, SGraham, MAGoodwin, LGuichard, SHudson, KWard, RAWhittaker, D Discovery and optimization of a novel series of Dyrk1B kinase inhibitors to explore a MEK resistance hypothesis. J Med Chem 58:2834-44 (2015)  
Target
Name:
Dual specificity tyrosine-phosphorylation-regulated kinase 1B
Synonyms:
DYR1B_HUMAN Dual specificity tyrosine-phosphorylation-regulated kinase 1B MIRK
Type:
Enzyme
Mol. Mass.:
69222.24
Organism:
Homo sapiens (Human)
Description:
Q9Y463
Residue:
629
  
Inhibitor
Name:
BDBM50081183
Synonyms:
CHEMBL3421965
Type:
Small organic molecule
Emp. Form.:
C25H27N7O2
Mol. Mass.:
457.5276
SMILES:
COc1cc(ccc1Nc1cc(ncn1)-c1cn(C)c2cnccc12)N1CCN(CC1)C(C)=O
: