Target
Cytochrome P450 3A4
Ligand
BDBM50435005
Substrate
Meas. Tech.
ChEMBL_1474033 (CHEMBL3423891)
Ki
375±n/a nM
Citation
 Lv, WLiu, JSkaar, TCFlockhart, DACushman, M Design and synthesis of norendoxifen analogues with dual aromatase inhibitory and estrogen receptor modulatory activities. J Med Chem 58:2623-48 (2015)  
Target
Name:
Cytochrome P450 3A4
Synonyms:
Albendazole monooxygenase CP3A4_HUMAN CYP3A4 CYPIIIA4 Cytochrome P450 3A4 (CYP3A4) Nifedipine oxidase Taurochenodeoxycholate 6-alpha-hydroxylase
Type:
Enzyme
Mol. Mass.:
57349.57
Organism:
Homo sapiens (Human)
Description:
Residue:
503
  
Inhibitor
Name:
BDBM50435005
Synonyms:
CHEMBL2386285
Type:
Small organic molecule
Emp. Form.:
C24H25NO2
Mol. Mass.:
359.4608
SMILES:
CC\C(=C(\c1ccc(O)cc1)c1ccc(OCCN)cc1)c1ccccc1
: