Target
Cytochrome P450 2A6
Ligand
BDBM50435005
Substrate
Meas. Tech.
ChEMBL_1474035 (CHEMBL3423893)
Ki
2180±n/a nM
Citation
 Lv, WLiu, JSkaar, TCFlockhart, DACushman, M Design and synthesis of norendoxifen analogues with dual aromatase inhibitory and estrogen receptor modulatory activities. J Med Chem 58:2623-48 (2015)  
Target
Name:
Cytochrome P450 2A6
Synonyms:
1,4-cineole 2-exo-monooxygenase CP2A6_HUMAN CYP2A6 Coumarin 7-hydroxylase Cytochrome P450 IIA3 | Cytochrome P450(I)
Type:
Protein
Mol. Mass.:
56514.34
Organism:
Homo sapiens (Human)
Description:
P11509
Residue:
494
  
Inhibitor
Name:
BDBM50435005
Synonyms:
CHEMBL2386285
Type:
Small organic molecule
Emp. Form.:
C24H25NO2
Mol. Mass.:
359.4608
SMILES:
CC\C(=C(\c1ccc(O)cc1)c1ccc(OCCN)cc1)c1ccccc1
: