Target
Muscle, skeletal receptor tyrosine-protein kinase
Ligand
BDBM50081537
Substrate
Meas. Tech.
ChEMBL_1474077 (CHEMBL3423972)
IC50
690±n/a nM
Citation
 Liu, YLang, YPatel, NKNg, GLaufer, RLi, SWEdwards, LForrest, BSampson, PBFeher, MBan, FAwrey, DEBeletskaya, IMao, GHodgson, RPlotnikova, OQiu, WChirgadze, NYMason, JMWei, XLin, DCChe, YKiarash, RMadeira, BFletcher, GCMak, TWBray, MRPauls, HW The Discovery of Orally Bioavailable Tyrosine Threonine Kinase (TTK) Inhibitors: 3-(4-(heterocyclyl)phenyl)-1H-indazole-5-carboxamides as Anticancer Agents. J Med Chem 58:3366-92 (2015)  
Target
Name:
Muscle, skeletal receptor tyrosine-protein kinase
Synonyms:
MUSK Muscle, skeletal receptor tyrosine protein kinase
Type:
PROTEIN
Mol. Mass.:
97062.85
Organism:
Homo sapiens (Human)
Description:
ChEMBL_1474077
Residue:
869
  
Inhibitor
Name:
BDBM50081537
Synonyms:
CHEMBL3422092
Type:
Small organic molecule
Emp. Form.:
C30H31N5O2
Mol. Mass.:
493.5994
SMILES:
[H][C@]12CC[C@@]([H])(CC(O)C1)N2c1ccc(cc1)-c1n[nH]c2ccc(cc12)C(=O)N[C@H](C1CC1)c1ccccn1
: