Target
Dual specificity protein kinase TTK
Ligand
BDBM50081539
Substrate
Meas. Tech.
ChEMBL_1474183 (CHEMBL3424201)
IC50
1.000000±n/a nM
Citation
 Liu, YLang, YPatel, NKNg, GLaufer, RLi, SWEdwards, LForrest, BSampson, PBFeher, MBan, FAwrey, DEBeletskaya, IMao, GHodgson, RPlotnikova, OQiu, WChirgadze, NYMason, JMWei, XLin, DCChe, YKiarash, RMadeira, BFletcher, GCMak, TWBray, MRPauls, HW The Discovery of Orally Bioavailable Tyrosine Threonine Kinase (TTK) Inhibitors: 3-(4-(heterocyclyl)phenyl)-1H-indazole-5-carboxamides as Anticancer Agents. J Med Chem 58:3366-92 (2015)  
Target
Name:
Dual specificity protein kinase TTK
Synonyms:
Dual specificity protein kinase (TTK) MPS1 Monopolar Spindle 1 (MPS1) Monopolar Spindle 1 Kinase (MPS1) TTK | TTK_HUMAN
Type:
Protein
Mol. Mass.:
97086.79
Organism:
Homo sapiens (Human)
Description:
P33981
Residue:
857
  
Inhibitor
Name:
BDBM50081539
Synonyms:
CHEMBL3422104
Type:
Small organic molecule
Emp. Form.:
C29H28N6O
Mol. Mass.:
476.5722
SMILES:
CC(C)CNc1nc(cn2c(cnc12)-c1ccc(cc1)C(=O)NC1CC1)-c1cccc2ncccc12
: