Target
Dual specificity protein kinase TTK
Ligand
BDBM50081574
Substrate
Meas. Tech.
ChEMBL_1474037 (CHEMBL3423895)
IC50
1.2±n/a nM
Citation
 Liu, YLang, YPatel, NKNg, GLaufer, RLi, SWEdwards, LForrest, BSampson, PBFeher, MBan, FAwrey, DEBeletskaya, IMao, GHodgson, RPlotnikova, OQiu, WChirgadze, NYMason, JMWei, XLin, DCChe, YKiarash, RMadeira, BFletcher, GCMak, TWBray, MRPauls, HW The Discovery of Orally Bioavailable Tyrosine Threonine Kinase (TTK) Inhibitors: 3-(4-(heterocyclyl)phenyl)-1H-indazole-5-carboxamides as Anticancer Agents. J Med Chem 58:3366-92 (2015)  
Target
Name:
Dual specificity protein kinase TTK
Synonyms:
Dual specificity protein kinase (TTK) MPS1 Monopolar Spindle 1 (MPS1) Monopolar Spindle 1 Kinase (MPS1) TTK | TTK_HUMAN
Type:
Protein
Mol. Mass.:
97086.79
Organism:
Homo sapiens (Human)
Description:
P33981
Residue:
857
  
Inhibitor
Name:
BDBM50081574
Synonyms:
CHEMBL3422086
Type:
Small organic molecule
Emp. Form.:
C31H33N5O2
Mol. Mass.:
507.626
SMILES:
O=C(N[C@@H](C1CCCC1)c1ccccn1)c1ccc2[nH]nc(-c3ccc(cc3)N3C4CCC3COC4)c2c1
: