Target
1-deoxy-D-xylulose 5-phosphate reductoisomerase
Ligand
BDBM50380000
Substrate
Meas. Tech.
ChEMBL_1474511 (CHEMBL3423800)
IC50
1150±n/a nM
Citation
 Chofor, RSooriyaarachchi, SRisseeuw, MDBergfors, TPouyez, JJohny, CHaymond, AEveraert, ADowd, CSMaes, LCoenye, TAlex, ACouch, RDJones, TAWouters, JMowbray, SLVan Calenbergh, S Synthesis and bioactivity of฿-substituted fosmidomycin analogues targeting 1-deoxy-D-xylulose-5-phosphate reductoisomerase. J Med Chem 58:2988-3001 (2015)  
Target
Name:
1-deoxy-D-xylulose 5-phosphate reductoisomerase
Synonyms:
1-Deoxy-D-xylulose 5-phosphate reductoisomerase (DXP) 1-deoxy-D-xylulose 5-phosphate reductoisomerase (DXR) DXP reductoisomerase dxr yaeM
Type:
Protein
Mol. Mass.:
43384.52
Organism:
Escherichia coli
Description:
P45568
Residue:
398
  
Inhibitor
Name:
BDBM50380000
Synonyms:
CHEMBL258981
Type:
Small organic molecule
Emp. Form.:
C5H12NO5P
Mol. Mass.:
197.1262
SMILES:
CN(O)C(=O)CCCP(O)(O)=O
: