Target
Cytochrome P450 1A1
Ligand
BDBM50081720
Substrate
Meas. Tech.
ChEMBL_1474527 (CHEMBL3423816)
IC50
13±n/a nM
Citation
 Cui, JMeng, QZhang, XCui, QZhou, WLi, S Design and Synthesis of Newa-Naphthoflavones as Cytochrome P450 (CYP) 1B1 Inhibitors To Overcome Docetaxel-Resistance Associated with CYP1B1 Overexpression. J Med Chem 58:3534-47 (2015)  
Target
Name:
Cytochrome P450 1A1
Synonyms:
CP1A1_HUMAN CYPIA1 Cytochrome P450 1A1 P450 form 6 P450-P1
Type:
Protein
Mol. Mass.:
58177.23
Organism:
Homo sapiens (Human)
Description:
P04798
Residue:
512
  
Inhibitor
Name:
BDBM50081720
Synonyms:
CHEMBL3422340
Type:
Small organic molecule
Emp. Form.:
C23H20O6
Mol. Mass.:
392.4013
SMILES:
COc1ccc(cc1)-c1cc(=O)c2cc(OC)c3c(OC)ccc(OC)c3c2o1
: