Target
Cytochrome P450 1A2
Ligand
BDBM50014323
Substrate
Meas. Tech.
ChEMBL_1474524 (CHEMBL3423813)
IC50
6.0±n/a nM
Citation
 Cui, JMeng, QZhang, XCui, QZhou, WLi, S Design and Synthesis of Newa-Naphthoflavones as Cytochrome P450 (CYP) 1B1 Inhibitors To Overcome Docetaxel-Resistance Associated with CYP1B1 Overexpression. J Med Chem 58:3534-47 (2015)  
Target
Name:
Cytochrome P450 1A2
Synonyms:
CP1A2_HUMAN CYPIA2 Cytochrome P(3)450 Cytochrome P450 1A2 (CYP1A2) Cytochrome P450-P3
Type:
Enzyme
Mol. Mass.:
58423.38
Organism:
Homo sapiens (Human)
Description:
P05177
Residue:
516
  
Inhibitor
Name:
BDBM50014323
Synonyms:
2-PHENYL-4H-BENZO[H]CHROMEN-4-ONE 7,8-Benzoflavone alpha-naphthoflavone
Type:
Small organic molecule
Emp. Form.:
C19H12O2
Mol. Mass.:
272.2974
SMILES:
O=c1cc(oc2c3ccccc3ccc12)-c1ccccc1
: