Target
Cytochrome P450 1A1
Ligand
BDBM50081874
Substrate
Meas. Tech.
ChEMBL_1474527 (CHEMBL3423816)
IC50
67±n/a nM
Citation
 Cui, JMeng, QZhang, XCui, QZhou, WLi, S Design and Synthesis of Newa-Naphthoflavones as Cytochrome P450 (CYP) 1B1 Inhibitors To Overcome Docetaxel-Resistance Associated with CYP1B1 Overexpression. J Med Chem 58:3534-47 (2015)  
Target
Name:
Cytochrome P450 1A1
Synonyms:
CP1A1_HUMAN CYPIA1 Cytochrome P450 1A1 P450 form 6 P450-P1
Type:
Protein
Mol. Mass.:
58177.23
Organism:
Homo sapiens (Human)
Description:
P04798
Residue:
512
  
Inhibitor
Name:
BDBM50081874
Synonyms:
CHEMBL3422349
Type:
Small organic molecule
Emp. Form.:
C22H17FO6
Mol. Mass.:
396.3652
SMILES:
COc1ccc(OC)c2c1c(OC)cc1c2oc(-c2cccc(F)c2)c(O)c1=O
: