Target
Tyrosyl-DNA phosphodiesterase 1
Ligand
BDBM50425088
Substrate
Meas. Tech.
ChEMBL_1474545 (CHEMBL3423834)
IC50
1000±n/a nM
Citation
 Nguyen, TXAbdelmalak, MMarchand, CAgama, KPommier, YCushman, M Synthesis and biological evaluation of nitrated 7-, 8-, 9-, and 10-hydroxyindenoisoquinolines as potential dual topoisomerase I (Top1)-tyrosyl-DNA phosphodiesterase I (TDP1) inhibitors. J Med Chem 58:3188-208 (2015)  
Target
Name:
Tyrosyl-DNA phosphodiesterase 1
Synonyms:
TDP1 Tyrosyl-DNA phosphodiesterase 1 | Tyrosyl-DNA phosphodiesterase 1 (TDP1)
Type:
Enzyme
Mol. Mass.:
68430.66
Organism:
Homo sapiens (Human)
Description:
Q9NUW8
Residue:
608
  
Inhibitor
Name:
BDBM50425088
Synonyms:
CHEMBL375623 | US9402842, 54
Type:
Small organic molecule
Emp. Form.:
C20H17N3O5
Mol. Mass.:
379.3661
SMILES:
COc1ccc-2c(c1)C(=O)c1c-2n(CCCN)c(=O)c2cc(ccc12)[N+]([O-])=O
: