Target
Neuropeptide FF receptor 1
Ligand
BDBM50082073
Substrate
Meas. Tech.
ChEMBL_1474637 (CHEMBL3423987)
EC50
>5000±n/a nM
Citation
 Beltramo, MRobert, VGalibert, MMadinier, JBMarceau, PDardente, HDecourt, CDe Roux, NLomet, DDelmas, AFCaraty, AAucagne, V Rational design of triazololipopeptides analogs of kisspeptin inducing a long-lasting increase of gonadotropins. J Med Chem 58:3459-70 (2015)  
Target
Name:
Neuropeptide FF receptor 1
Synonyms:
G-protein coupled receptor 147 NPFF1 NPFFR1 | RFamide-related peptide receptor OT7T022
Type:
PROTEIN
Mol. Mass.:
47840.07
Organism:
Homo sapiens (Human)
Description:
ChEMBL_1474637
Residue:
430
  
Inhibitor
Name:
BDBM50082073
Synonyms:
CHEMBL3422407
Type:
Small organic molecule
Emp. Form.:
C65H85N17O16
Mol. Mass.:
1360.4747
SMILES:
CC(C)C[C@H](NC(=O)CNC(=O)[C@H](Cc1ccccc1)NC(=O)[C@H](CO)NC(=O)[C@H](CC(N)=O)NC(=O)[C@H](Cc1c[nH]c2ccccc12)NC(=O)[C@H](CC(N)=O)NC(=O)[C@H](Cc1ccc(O)cc1)NC(C)=O)C(=O)N[C@@H](CCCNC(N)=N)C(=O)N[C@@H](Cc1ccc(O)cc1)C(N)=O
: