Target
Neuronal acetylcholine receptor subunit alpha-7
Ligand
BDBM50319936
Substrate
Meas. Tech.
ChEMBL_1475134 (CHEMBL3424812)
EC50
25±n/a nM
Citation
 Beinat, CReekie, TBanister, SDO'Brien-Brown, JXie, TOlson, TTXiao, YHarvey, AO'Connor, SColes, CGrishin, AKolesik, PTsanaktsidis, JKassiou, M Structure-activity relationship studies of SEN12333 analogues: determination of the optimal requirements for binding affinities ata7 nAChRs through incorporation of known structural motifs. Eur J Med Chem 95:277-301 (2015)  
Target
Name:
Neuronal acetylcholine receptor subunit alpha-7
Synonyms:
ACHA7_RAT Cholinergic, Nicotinic Alpha7 Chrna7 Neuronal acetylcholine receptor (alpha7 nAChR) Neuronal acetylcholine receptor subunit alpha-7 Neuronal acetylcholine receptor subunit alpha-7 (nAChR)
Type:
Enzyme
Mol. Mass.:
56502.44
Organism:
Rattus norvegicus (Rat)
Description:
Q05941
Residue:
502
  
Inhibitor
Name:
BDBM50319936
Synonyms:
(1S,4S)-2-methyl-5-(6-phenylpyridazin-3-yl)-2,5-diazabicyclo[2.2.1]heptane | CHEMBL1082655
Type:
Small organic molecule
Emp. Form.:
C16H18N4
Mol. Mass.:
266.3409
SMILES:
CN1C[C@@H]2C[C@H]1CN2c1ccc(nn1)-c1ccccc1
: