Target
6-phosphofructo-2-kinase/fructose-2,6-bisphosphatase 3
Ligand
BDBM50082117
Substrate
Meas. Tech.
ChEMBL_1475335 (CHEMBL3425232)
IC50
15400±n/a nM
Citation
 Boyd, SBrookfield, JLCritchlow, SECumming, IACurtis, NJDebreczeni, JDegorce, SLDonald, CEvans, NJGroombridge, SHopcroft, PJones, NPKettle, JGLamont, SLewis, HJMacFaull, PMcLoughlin, SBRigoreau, LJSmith, JMSt-Gallay, SStock, JKTurnbull, APWheatley, ERWinter, JWingfield, J Structure-Based Design of Potent and Selective Inhibitors of the Metabolic Kinase PFKFB3. J Med Chem 58:3611-25 (2015)  
Target
Name:
6-phosphofructo-2-kinase/fructose-2,6-bisphosphatase 3
Synonyms:
6-phosphofructo-2-kinase 6-phosphofructo-2-kinase/fructose-2,6-bisphosphatase 3 (PFKFB3) 6PF-2-K/Fru-2,6-P2ase brain/placenta-type isozyme Fructose-2,6-bisphosphatase PFKFB3 iPFK-2
Type:
Enzyme
Mol. Mass.:
59620.59
Organism:
Homo sapiens (Human)
Description:
Q16875
Residue:
520
  
Inhibitor
Name:
BDBM50082117
Synonyms:
CHEMBL3422677
Type:
Small organic molecule
Emp. Form.:
C23H25N5O2
Mol. Mass.:
403.4769
SMILES:
CC(C)Cn1nc(C#N)c2cc(Oc3ccc(NC(=O)[C@@H]4CCCN4)cc3)ccc12
: