Target
6-phosphofructo-2-kinase/fructose-2,6-bisphosphatase 2
Ligand
BDBM50082134
Substrate
Meas. Tech.
ChEMBL_1475279 (CHEMBL3425139)
IC50
2520±n/a nM
Citation
 Boyd, SBrookfield, JLCritchlow, SECumming, IACurtis, NJDebreczeni, JDegorce, SLDonald, CEvans, NJGroombridge, SHopcroft, PJones, NPKettle, JGLamont, SLewis, HJMacFaull, PMcLoughlin, SBRigoreau, LJSmith, JMSt-Gallay, SStock, JKTurnbull, APWheatley, ERWinter, JWingfield, J Structure-Based Design of Potent and Selective Inhibitors of the Metabolic Kinase PFKFB3. J Med Chem 58:3611-25 (2015)  
Target
Name:
6-phosphofructo-2-kinase/fructose-2,6-bisphosphatase 2
Synonyms:
6-phosphofructo-2-kinase 6PF-2-K/Fru-2,6-P2ase 2 F262_HUMAN PFK/FBPase 2 | PFKFB2
Type:
PROTEIN
Mol. Mass.:
58485.20
Organism:
Homo sapiens (Human)
Description:
ChEMBL_109607
Residue:
505
  
Inhibitor
Name:
BDBM50082134
Synonyms:
CHEMBL3422657
Type:
Small organic molecule
Emp. Form.:
C21H23N5O2
Mol. Mass.:
377.4396
SMILES:
CC(C)Cn1c(N)c(C#N)c2cc(Oc3ccc(NC(=O)CN)cc3)ccc12
: