Target
Pancreatic triacylglycerol lipase
Ligand
BDBM23409
Substrate
Meas. Tech.
ChEMBL_1474109 (CHEMBL3424042)
IC50
>70000±n/a nM
Citation
 Jeong, JYJo, YHKim, SBLiu, QLee, JWMo, EJLee, KYHwang, BYLee, MK Pancreatic lipase inhibitory constituents from Morus alba leaves and optimization for extraction conditions. Bioorg Med Chem Lett 25:2269-74 (2015)  
Target
Name:
Pancreatic triacylglycerol lipase
Synonyms:
LIPP_PIG PNLIP Pancreatic lipase | Pancreatic triacylglycerol lipase
Type:
Enzyme
Mol. Mass.:
50080.69
Organism:
Sus scrofa (Pig)
Description:
P00591
Residue:
450
  
Inhibitor
Name:
BDBM23409
Synonyms:
3,5,7-trihydroxy-2-(4-hydroxy-3-methoxyphenyl)-4H-chromen-4-one Isorhamnetin | Isorhamnetin (17)
Type:
flavonol
Emp. Form.:
C16H12O7
Mol. Mass.:
316.2623
SMILES:
COc1cc(ccc1O)-c1oc2cc(O)cc(O)c2c(=O)c1O
: