Target
Pancreatic triacylglycerol lipase
Ligand
BDBM50083068
Substrate
Meas. Tech.
ChEMBL_1474109 (CHEMBL3424042)
IC50
>70000±n/a nM
Citation
 Jeong, JYJo, YHKim, SBLiu, QLee, JWMo, EJLee, KYHwang, BYLee, MK Pancreatic lipase inhibitory constituents from Morus alba leaves and optimization for extraction conditions. Bioorg Med Chem Lett 25:2269-74 (2015)  
Target
Name:
Pancreatic triacylglycerol lipase
Synonyms:
LIPP_PIG PNLIP Pancreatic lipase | Pancreatic triacylglycerol lipase
Type:
Enzyme
Mol. Mass.:
50080.69
Organism:
Sus scrofa (Pig)
Description:
P00591
Residue:
450
  
Inhibitor
Name:
BDBM50083068
Synonyms:
CHEMBL3422847
Type:
Small organic molecule
Emp. Form.:
C22H22O11
Mol. Mass.:
462.4035
SMILES:
COc1ccc(cc1)-c1oc2cc(O)cc(O)c2c(=O)c1OC1O[C@H](CO)[C@@H](O)[C@H](O)[C@H]1O
: