Target
Pancreatic triacylglycerol lipase
Ligand
BDBM50381284
Substrate
Meas. Tech.
ChEMBL_1474109 (CHEMBL3424042)
IC50
32000±n/a nM
Citation
 Jeong, JYJo, YHKim, SBLiu, QLee, JWMo, EJLee, KYHwang, BYLee, MK Pancreatic lipase inhibitory constituents from Morus alba leaves and optimization for extraction conditions. Bioorg Med Chem Lett 25:2269-74 (2015)  
Target
Name:
Pancreatic triacylglycerol lipase
Synonyms:
LIPP_PIG PNLIP Pancreatic lipase | Pancreatic triacylglycerol lipase
Type:
Enzyme
Mol. Mass.:
50080.69
Organism:
Sus scrofa (Pig)
Description:
P00591
Residue:
450
  
Inhibitor
Name:
BDBM50381284
Synonyms:
CHEMBL2018876
Type:
Small organic molecule
Emp. Form.:
C19H18O4
Mol. Mass.:
310.3438
SMILES:
[#6]\[#6](-[#6])=[#6]\[#6]-c1c(-[#8])cc(cc1-[#8])-c1cc2ccc(-[#8])cc2o1
: