Target
D(2) dopamine receptor
Ligand
BDBM50083546
Substrate
Meas. Tech.
ChEMBL_1474457 (CHEMBL3423746)
Kd
500±n/a nM
Citation
 Molero, AVendrell, MBonaventura, JZachmann, JLópez, LPardo, LLluis, CCortés, AAlbericio, FCasadó, VRoyo, M A solid-phase combinatorial approach for indoloquinolizidine-peptides with high affinity at D(1) and D(2) dopamine receptors. Eur J Med Chem 97:173-80 (2015)  
Target
Name:
D(2) dopamine receptor
Synonyms:
D(2) dopamine receptor DOPAMINE D2 Long DRD2 Dopamine D2 receptor Dopamine D2 receptor (D2R) Dopamine2-like | d2
Type:
Cell-surface receptors
Mol. Mass.:
50647.10
Organism:
Homo sapiens (Human)
Description:
P14416
Residue:
443
  
Inhibitor
Name:
BDBM50083546
Synonyms:
CHEMBL3423408
Type:
Small organic molecule
Emp. Form.:
C42H57FN8O5
Mol. Mass.:
772.951
SMILES:
[H][C@]12CC[C@@H](CN1CCc1c2[nH]c2ccccc12)C(=O)NCCCCCC(=O)N[C@@H](CCCC)C(=O)N[C@@H](Cc1ccc(F)cc1)C(=O)N1C[C@@H](N)C[C@H]1C(N)=O
: