Target
Fatty-acid amide hydrolase 1
Ligand
BDBM50083691
Substrate
Meas. Tech.
ChEMBL_1474893 (CHEMBL3423529)
IC50
281±n/a nM
Citation
 Aghazadeh Tabrizi, MBaraldi, PGRuggiero, ESaponaro, GBaraldi, SRomagnoli, RMartinelli, ATuccinardi, T Pyrazole phenylcyclohexylcarbamates as inhibitors of human fatty acid amide hydrolases (FAAH). Eur J Med Chem 97:289-305 (2015)  
Target
Name:
Fatty-acid amide hydrolase 1
Synonyms:
Anandamide amidohydrolase FAAH FAAH1_HUMAN Fatty-acid amide hydrolase (FAAH) Oleamide hydrolase 1
Type:
Protein
Mol. Mass.:
63071.19
Organism:
Homo sapiens (Human)
Description:
O00519
Residue:
579
  
Inhibitor
Name:
BDBM50083691
Synonyms:
CHEMBL3423108
Type:
Small organic molecule
Emp. Form.:
C25H26ClN3O4
Mol. Mass.:
467.945
SMILES:
CCOC(=O)c1cc(-c2ccc(OC(=O)NC3CCCCC3)cc2)n(n1)-c1ccc(Cl)cc1
: