Target
Peroxisome proliferator-activated receptor gamma
Ligand
BDBM50030474
Substrate
Meas. Tech.
ChEMBL_1477131 (CHEMBL3428440)
IC50
76±n/a nM
Citation
 Du, GFeng, LYang, ZShi, JHuang, CGuo, FLi, BZhu, WLi, Y Separation and peroxisome proliferator-activated receptor-¿ agonist activity evaluation of synthetic racemic bavachinin enantiomers. Bioorg Med Chem Lett 25:2579-83 (2015)  
Target
Name:
Peroxisome proliferator-activated receptor gamma
Synonyms:
NR1C3 PPAR-gamma PPARG_HUMAN Peroxisome proliferator-activated receptor gamma (PPAR gamma) Peroxisome proliferator-activated receptor gamma (PPARγ) peroxisome proliferator-activated receptor gamma isoform 2
Type:
Nuclear Receptor
Mol. Mass.:
57613.46
Organism:
Homo sapiens (Human)
Description:
P37231
Residue:
505
  
Inhibitor
Name:
BDBM50030474
Synonyms:
Avandamet Avandia CHEBI:50122 US10744117, Compound Rosiglitazone | US9562012, rosiglitazone
Type:
Small organic molecule
Emp. Form.:
C18H19N3O3S
Mol. Mass.:
357.427
SMILES:
CN(CCOc1ccc(CC2SC(=O)NC2=O)cc1)c1ccccn1
: