Target
Beta-2 adrenergic receptor
Ligand
BDBM50084431
Substrate
Meas. Tech.
ChEMBL_1477238 (CHEMBL3428930)
EC50
0.158489±n/a nM
Citation
 Hughes, ADChen, YHegde, SSJasper, JRJaw-Tsai, SLee, TWMcNamara, APulido-Rios, MTSteinfeld, TMammen, M Discovery of (R)-1-(3-((2-chloro-4-(((2-hydroxy-2-(8-hydroxy-2-oxo-1,2-dihydroquinolin-5-yl)ethyl)amino)methyl)-5-methoxyphenyl)amino)-3-oxopropyl)piperidin-4-yl [1,1'-biphenyl]-2-ylcarbamate (TD-5959, GSK961081, batefenterol): first-in-class dual pharmacology multivalent muscarinic antagonist.. J Med Chem 58:2609-22 (2015)  
Target
Name:
Beta-2 adrenergic receptor
Synonyms:
ADRB2 ADRB2_HUMAN Beta-2 adrenoceptor | Beta-2 adrenoreceptor
Type:
Mol. Mass.:
46461.69
Organism:
Homo sapiens (Human)
Description:
P07550
Residue:
413
  
Inhibitor
Name:
BDBM50084431
Synonyms:
CHEMBL3426698
Type:
Small organic molecule
Emp. Form.:
C39H47N5O6
Mol. Mass.:
681.8204
SMILES:
O[C@@H](CNC[C@H]1CC[C@@H](CC1)NC(=O)CCN1CCC(CC1)OC(=O)Nc1ccccc1-c1ccccc1)c1ccc(O)c2[nH]c(=O)ccc12
: