Target
Muscarinic acetylcholine receptor M3
Ligand
BDBM50084422
Substrate
Meas. Tech.
ChEMBL_1477237 (CHEMBL3428929)
Ki
7.9±n/a nM
Citation
 Hughes, ADChen, YHegde, SSJasper, JRJaw-Tsai, SLee, TWMcNamara, APulido-Rios, MTSteinfeld, TMammen, M Discovery of (R)-1-(3-((2-chloro-4-(((2-hydroxy-2-(8-hydroxy-2-oxo-1,2-dihydroquinolin-5-yl)ethyl)amino)methyl)-5-methoxyphenyl)amino)-3-oxopropyl)piperidin-4-yl [1,1'-biphenyl]-2-ylcarbamate (TD-5959, GSK961081, batefenterol): first-in-class dual pharmacology multivalent muscarinic antagonist.. J Med Chem 58:2609-22 (2015)  
Target
Name:
Muscarinic acetylcholine receptor M3
Synonyms:
ACM3_HUMAN Cholinergic, muscarinic M3 Muscarinic receptor M3 | RecName: Full=Muscarinic acetylcholine receptor M3
Type:
Enzyme
Mol. Mass.:
66151.03
Organism:
Homo sapiens (Human)
Description:
P20309
Residue:
590
  
Inhibitor
Name:
BDBM50084422
Synonyms:
CHEMBL3426707
Type:
Small organic molecule
Emp. Form.:
C41H45N5O7
Mol. Mass.:
719.8253
SMILES:
COc1ccc(CCNC[C@H](O)c2ccc(O)c3[nH]c(=O)ccc23)cc1NC(=O)CCN1CCC(CC1)OC(=O)Nc1ccccc1-c1ccccc1
: