Target
Sodium/nucleoside cotransporter 2
Ligand
BDBM50085466
Substrate
Meas. Tech.
ChEMBL_1477251 (CHEMBL3428943)
IC50
>100000±n/a nM
Citation
 Tatani, KHiratochi, MNonaka, YIsaji, MShuto, S Identification of 8-aminoadenosine derivatives as a new class of human concentrative nucleoside transporter 2 inhibitors. ACS Med Chem Lett 6:244-8 (2015)  
Target
Name:
Sodium/nucleoside cotransporter 2
Synonyms:
CNT2 SLC28A2
Type:
PROTEIN
Mol. Mass.:
71934.06
Organism:
Homo sapiens (Human)
Description:
ChEMBL_1477251
Residue:
658
  
Inhibitor
Name:
BDBM50085466
Synonyms:
CHEMBL3427695
Type:
Small organic molecule
Emp. Form.:
C12H15N5O6
Mol. Mass.:
325.2774
SMILES:
COC(=O)OC[C@H]1O[C@H]([C@H](O)[C@@H]1O)n1cnc2c(N)ncnc12
: