Target
Free fatty acid receptor 1
Ligand
BDBM50085593
Substrate
Meas. Tech.
ChEMBL_1477257 (CHEMBL3428949)
EC50
3.9±n/a nM
Citation
 Takano, RYoshida, MInoue, MHonda, TNakashima, RMatsumoto, KYano, TOgata, TWatanabe, NHirouchi, MYoneyama, TIto, SToda, N Discovery of DS-1558: A Potent and Orally Bioavailable GPR40 Agonist. ACS Med Chem Lett 6:266-70 (2015)  
Target
Name:
Free fatty acid receptor 1
Synonyms:
FFAR1 G-protein Coupled Receptor 40 | GPR40
Type:
G Protein-Coupled Receptor (GPCR)
Mol. Mass.:
31473.32
Organism:
Homo sapiens (Human)
Description:
O14842
Residue:
300
  
Inhibitor
Name:
BDBM50085593
Synonyms:
CHEMBL3427703
Type:
Small organic molecule
Emp. Form.:
C18H18Cl2O4
Mol. Mass.:
369.239
SMILES:
CCO[C@@H](CC(O)=O)c1ccc(OCc2ccc(Cl)c(Cl)c2)cc1
: