Target
Cell division protein FtsZ
Ligand
BDBM50086191
Substrate
Meas. Tech.
ChEMBL_1477924 (CHEMBL3429345)
IC50
>128000±n/a nM
Citation
 Nepomuceno, GMChan, KMHuynh, VMartin, KSMoore, JTO'Brien, TEPollo, LASarabia, FJTadeus, CYao, ZAnderson, DEAmes, JBShaw, JT Synthesis and Evaluation of Quinazolines as Inhibitors of the Bacterial Cell Division Protein FtsZ. ACS Med Chem Lett 6:308-12 (2015)  
Target
Name:
Cell division protein FtsZ
Synonyms:
FTSZ_ECOLI sfiB | sulB
Type:
Protein
Mol. Mass.:
40305.83
Organism:
Escherichia coli
Description:
P0A9A6
Residue:
383
  
Inhibitor
Name:
BDBM50086191
Synonyms:
CHEMBL3425690
Type:
Small organic molecule
Emp. Form.:
C21H24ClN5O
Mol. Mass.:
397.901
SMILES:
CN(C)CCNc1nc(nc2ccc(C)cc12)C(=O)NCc1ccc(Cl)cc1
: