Target
Catechol O-methyltransferase
Ligand
BDBM50086210
Substrate
Meas. Tech.
ChEMBL_1477937 (CHEMBL3429504)
IC50
19±n/a nM
Citation
 Harrison, STPoslusney, MSMulhearn, JJZhao, ZKett, NRSchubert, JWMelamed, JYAllison, TJPatel, SBSanders, JMSharma, SSmith, RFHall, DLRobinson, RGSachs, NAHutson, PHWolkenberg, SEBarrow, JC Synthesis and Evaluation of Heterocyclic Catechol Mimics as Inhibitors of Catechol-O-methyltransferase (COMT). ACS Med Chem Lett 6:318-23 (2015)  
Target
Name:
Catechol O-methyltransferase
Synonyms:
COMT_RAT Catechol-O-methyltransferase | Comt
Type:
Enzyme
Mol. Mass.:
29594.09
Organism:
Rattus norvegicus (Rat)
Description:
Residue:
264
  
Inhibitor
Name:
BDBM50086210
Synonyms:
CHEMBL3425739
Type:
Small organic molecule
Emp. Form.:
C24H19NO3
Mol. Mass.:
369.4126
SMILES:
OC(c1ccccc1)c1cc(=O)c(O)cn1-c1cccc(c1)-c1ccccc1
: