Target
5-hydroxytryptamine receptor 2B
Ligand
BDBM50086246
Substrate
Meas. Tech.
ChEMBL_1477948 (CHEMBL3429515)
EC50
22±n/a nM
Citation
 Rouquet, GMoore, DESpain, MAllwood, DMBattilocchio, CBlakemore, DCFish, PVJenkinson, SJessiman, ASLey, SVMcMurray, GStorer, RI Design, Synthesis, and Evaluation of Tetrasubstituted Pyridines as Potent 5-HT2C Receptor Agonists. ACS Med Chem Lett 6:329-33 (2015)  
Target
Name:
5-hydroxytryptamine receptor 2B
Synonyms:
5-HT-2B 5-hydroxytryptamine (serotonin) receptor 2B [Homo sapiens] 5-hydroxytryptamine receptor 2C (5HT2C) HTR2B Serotonin 2b (5-HT2b) receptor | Serotonin Receptor 2B
Type:
G Protein-Coupled Receptor (GPCR)
Mol. Mass.:
54312.47
Organism:
Homo sapiens (Human)
Description:
Receptor binding assays were performed using human clone stably expressed in CHO cells.
Residue:
481
  
Inhibitor
Name:
BDBM50086246
Synonyms:
CHEMBL3425758
Type:
Small organic molecule
Emp. Form.:
C20H25N3
Mol. Mass.:
307.4326
SMILES:
C(Nc1nc(Cc2ccccc2)cc2CCNCCc12)C1CC1
: