Target
Cyclin-G-associated kinase
Ligand
BDBM50086268
Substrate
Meas. Tech.
ChEMBL_1478106 (CHEMBL3430283)
Kd
8.9±n/a nM
Citation
 Kovackova, SChang, LBekerman, ENeveu, GBarouch-Bentov, RChaikuad, AHeroven, C?ála, MDe Jonghe, SKnapp, SEinav, SHerdewijn, P Selective Inhibitors of Cyclin G Associated Kinase (GAK) as Anti-Hepatitis C Agents. J Med Chem 58:3393-410 (2015)  
Target
Name:
Cyclin-G-associated kinase
Synonyms:
GAK Serine/threonine-protein kinase GAK
Type:
PROTEIN
Mol. Mass.:
143171.28
Organism:
Homo sapiens (Human)
Description:
ChEMBL_1478229
Residue:
1311
  
Inhibitor
Name:
BDBM50086268
Synonyms:
CHEMBL3425867
Type:
Small organic molecule
Emp. Form.:
C17H18N4O2S
Mol. Mass.:
342.415
SMILES:
COc1cc(ccc1N)-c1cnc2c(snc2c1)N1CCOCC1
: