Target
Serine/threonine-protein kinase B-raf
Ligand
BDBM50086441
Substrate
Meas. Tech.
ChEMBL_1476350 (CHEMBL3429873)
IC50
92±n/a nM
Citation
 Zhang, CHZheng, MWLi, YPLin, XDHuang, MZhong, LLi, GBZhang, RJLin, WTJiao, YWu, XAYang, JXiang, RChen, LJZhao, YLCheng, WWei, YQYang, SY Design, Synthesis, and Structure-Activity Relationship Studies of 3-(Phenylethynyl)-1H-pyrazolo[3,4-d]pyrimidin-4-amine Derivatives as a New Class of Src Inhibitors with Potent Activities in Models of Triple Negative Breast Cancer. J Med Chem 58:3957-74 (2015)  
Target
Name:
Serine/threonine-protein kinase B-raf
Synonyms:
B-RAF B-Raf proto-oncogene serine/threonine-protein kinase BRAF1 RAFB1 v-Raf murine sarcoma viral oncogene homolog B1
Type:
Serine/threonine-protein kinase
Mol. Mass.:
84446.00
Organism:
Homo sapiens (Human)
Description:
P15056
Residue:
766
  
Inhibitor
Name:
BDBM50086441
Synonyms:
CHEMBL3426225 | US10266537, Compound 3
Type:
Small organic molecule
Emp. Form.:
C30H31F3N8O
Mol. Mass.:
576.6153
SMILES:
CCn1nc(C#Cc2cc(ccc2C)C(=O)Nc2ccc(CN3CCN(C)CC3)c(c2)C(F)(F)F)c2c(N)ncnc12
: