Target
Induced myeloid leukemia cell differentiation protein Mcl-1
Ligand
BDBM50086693
Substrate
Meas. Tech.
ChEMBL_1477328 (CHEMBL3429294)
Ki
9.0±n/a nM
Citation
 Burke, JPBian, ZShaw, SZhao, BGoodwin, CMBelmar, JBrowning, CFVigil, DFriberg, ACamper, DVRossanese, OWLee, TOlejniczak, ETFesik, SW Discovery of tricyclic indoles that potently inhibit Mcl-1 using fragment-based methods and structure-based design. J Med Chem 58:3794-805 (2015)  
Target
Name:
Induced myeloid leukemia cell differentiation protein Mcl-1
Synonyms:
BCL2L3 Bcl-2-like protein 3 (Mcl-1) Bcl2-L-3 MCL1 Mcl-1 Myeloid cell leukemia sequence 1 (BCL2-related) | mcl1/EAT
Type:
Membrane; Single-pass membrane protein
Mol. Mass.:
37332.87
Organism:
Homo sapiens (Human)
Description:
Q07820
Residue:
350
  
Inhibitor
Name:
BDBM50086693
Synonyms:
CHEMBL3426334
Type:
Small organic molecule
Emp. Form.:
C22H21Cl2NO4
Mol. Mass.:
434.312
SMILES:
Cc1cc(OCCCc2c(C(O)=O)n3CCOc4c(Cl)ccc2c34)cc(C)c1Cl
: