Target
Ubiquitin-like domain-containing CTD phosphatase 1
Ligand
BDBM50087865
Substrate
Meas. Tech.
ChEMBL_1476058 (CHEMBL3428554)
pH
6±n/a
IC50
13500±n/a nM
Comments
extracted
Citation
 He, YGuo, XYu, ZHWu, LGunawan, AMZhang, YDixon, JEZhang, ZY A potent and selective inhibitor for the UBLCP1 proteasome phosphatase. Bioorg Med Chem 23:2798-809 (2015)  
Target
Name:
Ubiquitin-like domain-containing CTD phosphatase 1
Synonyms:
Nuclear proteasome inhibitor UBLCP1 UBLCP1 | Ubiquitin-like domain-containing CTD phosphatase 1
Type:
Enzyme
Mol. Mass.:
36803.71
Organism:
Homo sapiens (Human)
Description:
Q8WVY7
Residue:
318
  
Inhibitor
Name:
BDBM50087865
Synonyms:
CHEMBL3426908
Type:
Small organic molecule
Emp. Form.:
C28H31NO7
Mol. Mass.:
493.5482
SMILES:
CCCCC(Oc1cc(O)c(cc1C#CC1CCCC1)C(O)=O)C(=O)Nc1ccc2OCCOc2c1
: