Target
Scavenger receptor class B member 1
Ligand
BDBM50323654
Substrate
Meas. Tech.
ChEMBL_1476715 (CHEMBL3429066)
IC50
770±n/a nM
Citation
 Dockendorff, CFaloon, PWGermain, AYu, MYoungsaye, WNag, PPBennion, MPenman, MNieland, TJDandapani, SPerez, JRMunoz, BPalmer, MASchreiber, SLKrieger, M Discovery of bisamide-heterocycles as inhibitors of scavenger receptor BI (SR-BI)-mediated lipid uptake. Bioorg Med Chem Lett 25:2594-8 (2015)  
Target
Name:
Scavenger receptor class B member 1
Synonyms:
SCRB1_MOUSE Scarb1 Srb1
Type:
PROTEIN
Mol. Mass.:
56761.39
Organism:
Mus musculus
Description:
ChEMBL_103999
Residue:
509
  
Inhibitor
Name:
BDBM50323654
Synonyms:
CHEMBL1208829 | N-(5-tert-butyl-2-methoxy-3-(methylsulfonamido)phenyl)-2-(4-(2-morpholinoethoxy)naphthalen-1-yl)-2-oxoacetamide
Type:
Small organic molecule
Emp. Form.:
C30H37N3O7S
Mol. Mass.:
583.696
SMILES:
COc1c(NC(=O)C(=O)c2ccc(OCCN3CCOCC3)c3ccccc23)cc(cc1NS(C)(=O)=O)C(C)(C)C
: